{"text_format":"1","workbook":"xlsx","n_sheets":4,"sheets":["Clasificación","Puntos","Socios","Carreras"],"not_rendered":{"charts":0,"images":1,"macros":1,"external_links":0,"defined_names":0,"comments":0,"pivot_tables":0},"unopened":[],"bounds":{"document_bytes":16777216,"sheet_cells":100000,"rows_first":2000,"rows_last":500,"rows_between":2000,"halvings":0,"cell_chars":16384,"cell_head_chars":4096},"cells_cut":0,"cells_raw":0,"read":"whole","date_system":"1900"}

{"sheet":"Clasificación","index":0,"n_rows":103,"n_cols":16,"rows_kept":103,"cut":false,"hidden":false,"merged":[[0,0,0,15],[1,4,1,5],[1,6,1,7],[1,8,1,9],[1,10,1,11],[1,12,1,13],[1,14,1,15]]}
["CAMPEONATO DE PRUEBA"]
[null,null,null,null,"1ª Prueba",null,"2ª Prueba",null,"3ª Prueba",null,"4ª Prueba",null,"Asistencia",null,"Copyright AECAR 2023"]
["Ord","Lic","Piloto","Región","Pos","Puntos","Pos","Puntos","Pos","Puntos","Pos","Puntos","nº","Puntos","TOTAL","Netos"]
[1,{"$f":"IF(Carreras!$K2=0,\"\",Carreras!$K2)","v":""},{"$f":"IF(B4=\"\",\"\",_xlfn.XLOOKUP(B4,Socios!A:A,Socios!B:B,FALSE,0,1))","v":""},{"$f":"IF(B4=\"\",\"\",_xlfn.XLOOKUP(B4,Socios!A:A,Socios!C:C,FALSE,0,1))","v":""},{"$f":"IF($B4=\"\",\"\",_xlfn.XLOOKUP($B4,Carreras!$B:$B,Carreras!$A:$A,0,0,1))","v":""},{"$f":"IF($B4=\"\",\"\",IF($E4=0,0,_xlfn.XLOOKUP($E4,Puntos!A:A,Puntos!B:B,TRUE)))","v":""},{"$f":"IF($B4=\"\",\"\",_xlfn.XLOOKUP($B4,Carreras!C:C,Carreras!A:A,0,0,1))","v":""},{"$f":"IF($B4=\"\",\"\",IF($G4=0,0,_xlfn.XLOOKUP($G4,Puntos!A:A,Puntos!B:B,TRUE)))","v":""},{"$f":"IF($B4=\"\",\"\",_xlfn.XLOOKUP($B4,Carreras!$D:$D,Carreras!$A:$A,0,0,1))","v":""},{"$f":"IF($B4=\"\",\"\",IF($I4=0,0,_xlfn.XLOOKUP($I4,Puntos!A:A,Puntos!B:B,TRUE)))","v":""},{"$f":"IF($B4=\"\",\"\",_xlfn.XLOOKUP($B4,Carreras!$E:$E,Carreras!$A:$A,0,0,1))","v":""},{"$f":"IF($B4=\"\",\"\",IF($K4=0,0,_xlfn.XLOOKUP($K4,Puntos!$A:$A,Puntos!$B:$B)))","v":""},{"$f":"IF($B4=\"\",\"\",COUNTIF(F4,\">0\")+COUNTIF(H4,\">0\")+COUNTIF(J4,\">0\")+COUNTIF(L4,\">0\"))","v":""},{"$f":"IF(B4=\"\",\"\",_xlfn.IFS(M4=0,0,M4=1,0,M4=2,50,M4=3,100,M4=4,150))","v":""},{"$f":"IF(B4=\"\",\"\",F4+H4+J4+L4+N4)","v":""},{"$f":"IF(B4=\"\",0,O4-MIN(F4,H4,J4,L4))","v":0}]
[{"$f":"A4+1","v":2},{"$f":"IF(Carreras!$K5=0,\"\",Carreras!$K5)","v":""},{"$f":"IF(B5=\"\",\"\",_xlfn.XLOOKUP(B5,Socios!A:A,Socios!B:B,FALSE,0,1))","v":""},{"$f":"IF(B5=\"\",\"\",_xlfn.XLOOKUP(B5,Socios!A:A,Socios!C:C,FALSE,0,1))","v":""},{"$f":"IF($B5=\"\",\"\",_xlfn.XLOOKUP($B5,Carreras!$B:$B,Carreras!$A:$A,0,0,1))","v":""},{"$f":"IF($B5=\"\",\"\",IF($E5=0,0,_xlfn.XLOOKUP($E5,Puntos!A:A,Puntos!B:B,TRUE)))","v":""},{"$f":"IF($B5=\"\",\"\",_xlfn.XLOOKUP($B5,Carreras!C:C,Carreras!A:A,0,0,1))","v":""},{"$f":"IF($B5=\"\",\"\",IF($G5=0,0,_xlfn.XLOOKUP($G5,Puntos!A:A,Puntos!B:B,TRUE)))","v":""},{"$f":"IF($B5=\"\",\"\",_xlfn.XLOOKUP($B5,Carreras!$D:$D,Carreras!$A:$A,0,0,1))","v":""},{"$f":"IF($B5=\"\",\"\",IF($I5=0,0,_xlfn.XLOOKUP($I5,Puntos!A:A,Puntos!B:B,TRUE)))","v":""},{"$f":"IF($B5=\"\",\"\",_xlfn.XLOOKUP($B5,Carreras!$E:$E,Carreras!$A:$A,0,0,1))","v":""},{"$f":"IF($B5=\"\",\"\",IF($K5=0,0,_xlfn.XLOOKUP($K5,Puntos!$A:$A,Puntos!$B:$B)))","v":""},"",{"$f":"IF(B5=\"\",\"\",_xlfn.IFS(M5=0,0,M5=1,0,M5=2,50,M5=3,100,M5=4,150))","v":""},"",0]
[{"$f":"A5+1","v":3},{"$f":"IF(Carreras!$K3=0,\"\",Carreras!$K3)","v":""},{"$f":"IF(B6=\"\",\"\",_xlfn.XLOOKUP(B6,Socios!A:A,Socios!B:B,FALSE,0,1))","v":""},{"$f":"IF(B6=\"\",\"\",_xlfn.XLOOKUP(B6,Socios!A:A,Socios!C:C,FALSE,0,1))","v":""},{"$f":"IF($B6=\"\",\"\",_xlfn.XLOOKUP($B6,Carreras!$B:$B,Carreras!$A:$A,0,0,1))","v":""},{"$f":"IF($B6=\"\",\"\",IF($E6=0,0,_xlfn.XLOOKUP($E6,Puntos!A:A,Puntos!B:B,TRUE)))","v":""},{"$f":"IF($B6=\"\",\"\",_xlfn.XLOOKUP($B6,Carreras!C:C,Carreras!A:A,0,0,1))","v":""},{"$f":"IF($B6=\"\",\"\",IF($G6=0,0,_xlfn.XLOOKUP($G6,Puntos!A:A,Puntos!B:B,TRUE)))","v":""},{"$f":"IF($B6=\"\",\"\",_xlfn.XLOOKUP($B6,Carreras!$D:$D,Carreras!$A:$A,0,0,1))","v":""},{"$f":"IF($B6=\"\",\"\",IF($I6=0,0,_xlfn.XLOOKUP($I6,Puntos!A:A,Puntos!B:B,TRUE)))","v":""},{"$f":"IF($B6=\"\",\"\",_xlfn.XLOOKUP($B6,Carreras!$E:$E,Carreras!$A:$A,0,0,1))","v":""},{"$f":"IF($B6=\"\",\"\",IF($K6=0,0,_xlfn.XLOOKUP($K6,Puntos!$A:$A,Puntos!$B:$B)))","v":""},"",{"$f":"IF(B6=\"\",\"\",_xlfn.IFS(M6=0,0,M6=1,0,M6=2,50,M6=3,100,M6=4,150))","v":""},"",0]
[4,{"$f":"IF(Carreras!$K9=0,\"\",Carreras!$K9)","v":""},{"$f":"IF(B7=\"\",\"\",_xlfn.XLOOKUP(B7,Socios!A:A,Socios!B:B,FALSE,0,1))","v":""},{"$f":"IF(B7=\"\",\"\",_xlfn.XLOOKUP(B7,Socios!A:A,Socios!C:C,FALSE,0,1))","v":""},{"$f":"IF($B7=\"\",\"\",_xlfn.XLOOKUP($B7,Carreras!$B:$B,Carreras!$A:$A,0,0,1))","v":""},{"$f":"IF($B7=\"\",\"\",IF($E7=0,0,_xlfn.XLOOKUP($E7,Puntos!A:A,Puntos!B:B,TRUE)))","v":""},{"$f":"IF($B7=\"\",\"\",_xlfn.XLOOKUP($B7,Carreras!C:C,Carreras!A:A,0,0,1))","v":""},{"$f":"IF($B7=\"\",\"\",IF($G7=0,0,_xlfn.XLOOKUP($G7,Puntos!A:A,Puntos!B:B,TRUE)))","v":""},{"$f":"IF($B7=\"\",\"\",_xlfn.XLOOKUP($B7,Carreras!$D:$D,Carreras!$A:$A,0,0,1))","v":""},{"$f":"IF($B7=\"\",\"\",IF($I7=0,0,_xlfn.XLOOKUP($I7,Puntos!A:A,Puntos!B:B,TRUE)))","v":""},{"$f":"IF($B7=\"\",\"\",_xlfn.XLOOKUP($B7,Carreras!$E:$E,Carreras!$A:$A,0,0,1))","v":""},{"$f":"IF($B7=\"\",\"\",IF($K7=0,0,_xlfn.XLOOKUP($K7,Puntos!$A:$A,Puntos!$B:$B)))","v":""},"",{"$f":"IF(B7=\"\",\"\",_xlfn.IFS(M7=0,0,M7=1,0,M7=2,50,M7=3,100,M7=4,150))","v":""},"",0]
[5,{"$f":"IF(Carreras!$K6=0,\"\",Carreras!$K6)","v":""},{"$f":"IF(B8=\"\",\"\",_xlfn.XLOOKUP(B8,Socios!A:A,Socios!B:B,FALSE,0,1))","v":""},{"$f":"IF(B8=\"\",\"\",_xlfn.XLOOKUP(B8,Socios!A:A,Socios!C:C,FALSE,0,1))","v":""},{"$f":"IF($B8=\"\",\"\",_xlfn.XLOOKUP($B8,Carreras!$B:$B,Carreras!$A:$A,0,0,1))","v":""},{"$f":"IF($B8=\"\",\"\",IF($E8=0,0,_xlfn.XLOOKUP($E8,Puntos!A:A,Puntos!B:B,TRUE)))","v":""},{"$f":"IF($B8=\"\",\"\",_xlfn.XLOOKUP($B8,Carreras!C:C,Carreras!A:A,0,0,1))","v":""},{"$f":"IF($B8=\"\",\"\",IF($G8=0,0,_xlfn.XLOOKUP($G8,Puntos!A:A,Puntos!B:B,TRUE)))","v":""},{"$f":"IF($B8=\"\",\"\",_xlfn.XLOOKUP($B8,Carreras!$D:$D,Carreras!$A:$A,0,0,1))","v":""},{"$f":"IF($B8=\"\",\"\",IF($I8=0,0,_xlfn.XLOOKUP($I8,Puntos!A:A,Puntos!B:B,TRUE)))","v":""},{"$f":"IF($B8=\"\",\"\",_xlfn.XLOOKUP($B8,Carreras!$E:$E,Carreras!$A:$A,0,0,1))","v":""},{"$f":"IF($B8=\"\",\"\",IF($K8=0,0,_xlfn.XLOOKUP($K8,Puntos!$A:$A,Puntos!$B:$B)))","v":""},"",{"$f":"IF(B8=\"\",\"\",_xlfn.IFS(M8=0,0,M8=1,0,M8=2,50,M8=3,100,M8=4,150))","v":""},"",0]
[6,{"$f":"IF(Carreras!$K8=0,\"\",Carreras!$K8)","v":""},{"$f":"IF(B9=\"\",\"\",_xlfn.XLOOKUP(B9,Socios!A:A,Socios!B:B,FALSE,0,1))","v":""},{"$f":"IF(B9=\"\",\"\",_xlfn.XLOOKUP(B9,Socios!A:A,Socios!C:C,FALSE,0,1))","v":""},{"$f":"IF($B9=\"\",\"\",_xlfn.XLOOKUP($B9,Carreras!$B:$B,Carreras!$A:$A,0,0,1))","v":""},{"$f":"IF($B9=\"\",\"\",IF($E9=0,0,_xlfn.XLOOKUP($E9,Puntos!A:A,Puntos!B:B,TRUE)))","v":""},{"$f":"IF($B9=\"\",\"\",_xlfn.XLOOKUP($B9,Carreras!C:C,Carreras!A:A,0,0,1))","v":""},{"$f":"IF($B9=\"\",\"\",IF($G9=0,0,_xlfn.XLOOKUP($G9,Puntos!A:A,Puntos!B:B,TRUE)))","v":""},{"$f":"IF($B9=\"\",\"\",_xlfn.XLOOKUP($B9,Carreras!$D:$D,Carreras!$A:$A,0,0,1))","v":""},{"$f":"IF($B9=\"\",\"\",IF($I9=0,0,_xlfn.XLOOKUP($I9,Puntos!A:A,Puntos!B:B,TRUE)))","v":""},{"$f":"IF($B9=\"\",\"\",_xlfn.XLOOKUP($B9,Carreras!$E:$E,Carreras!$A:$A,0,0,1))","v":""},{"$f":"IF($B9=\"\",\"\",IF($K9=0,0,_xlfn.XLOOKUP($K9,Puntos!$A:$A,Puntos!$B:$B)))","v":""},"",{"$f":"IF(B9=\"\",\"\",_xlfn.IFS(M9=0,0,M9=1,0,M9=2,50,M9=3,100,M9=4,150))","v":""},"",0]
[7,{"$f":"IF(Carreras!$K10=0,\"\",Carreras!$K10)","v":""},{"$f":"IF(B10=\"\",\"\",_xlfn.XLOOKUP(B10,Socios!A:A,Socios!B:B,FALSE,0,1))","v":""},{"$f":"IF(B10=\"\",\"\",_xlfn.XLOOKUP(B10,Socios!A:A,Socios!C:C,FALSE,0,1))","v":""},{"$f":"IF($B10=\"\",\"\",_xlfn.XLOOKUP($B10,Carreras!$B:$B,Carreras!$A:$A,0,0,1))","v":""},{"$f":"IF($B10=\"\",\"\",IF($E10=0,0,_xlfn.XLOOKUP($E10,Puntos!A:A,Puntos!B:B,TRUE)))","v":""},{"$f":"IF($B10=\"\",\"\",_xlfn.XLOOKUP($B10,Carreras!C:C,Carreras!A:A,0,0,1))","v":""},{"$f":"IF($B10=\"\",\"\",IF($G10=0,0,_xlfn.XLOOKUP($G10,Puntos!A:A,Puntos!B:B,TRUE)))","v":""},{"$f":"IF($B10=\"\",\"\",_xlfn.XLOOKUP($B10,Carreras!$D:$D,Carreras!$A:$A,0,0,1))","v":""},{"$f":"IF($B10=\"\",\"\",IF($I10=0,0,_xlfn.XLOOKUP($I10,Puntos!A:A,Puntos!B:B,TRUE)))","v":""},{"$f":"IF($B10=\"\",\"\",_xlfn.XLOOKUP($B10,Carreras!$E:$E,Carreras!$A:$A,0,0,1))","v":""},{"$f":"IF($B10=\"\",\"\",IF($K10=0,0,_xlfn.XLOOKUP($K10,Puntos!$A:$A,Puntos!$B:$B)))","v":""},"",{"$f":"IF(B10=\"\",\"\",_xlfn.IFS(M10=0,0,M10=1,0,M10=2,50,M10=3,100,M10=4,150))","v":""},"",0]
[8,{"$f":"IF(Carreras!$K7=0,\"\",Carreras!$K7)","v":""},{"$f":"IF(B11=\"\",\"\",_xlfn.XLOOKUP(B11,Socios!A:A,Socios!B:B,FALSE,0,1))","v":""},{"$f":"IF(B11=\"\",\"\",_xlfn.XLOOKUP(B11,Socios!A:A,Socios!C:C,FALSE,0,1))","v":""},{"$f":"IF($B11=\"\",\"\",_xlfn.XLOOKUP($B11,Carreras!$B:$B,Carreras!$A:$A,0,0,1))","v":""},{"$f":"IF($B11=\"\",\"\",IF($E11=0,0,_xlfn.XLOOKUP($E11,Puntos!A:A,Puntos!B:B,TRUE)))","v":""},{"$f":"IF($B11=\"\",\"\",_xlfn.XLOOKUP($B11,Carreras!C:C,Carreras!A:A,0,0,1))","v":""},{"$f":"IF($B11=\"\",\"\",IF($G11=0,0,_xlfn.XLOOKUP($G11,Puntos!A:A,Puntos!B:B,TRUE)))","v":""},{"$f":"IF($B11=\"\",\"\",_xlfn.XLOOKUP($B11,Carreras!$D:$D,Carreras!$A:$A,0,0,1))","v":""},{"$f":"IF($B11=\"\",\"\",IF($I11=0,0,_xlfn.XLOOKUP($I11,Puntos!A:A,Puntos!B:B,TRUE)))","v":""},{"$f":"IF($B11=\"\",\"\",_xlfn.XLOOKUP($B11,Carreras!$E:$E,Carreras!$A:$A,0,0,1))","v":""},{"$f":"IF($B11=\"\",\"\",IF($K11=0,0,_xlfn.XLOOKUP($K11,Puntos!$A:$A,Puntos!$B:$B)))","v":""},"",{"$f":"IF(B11=\"\",\"\",_xlfn.IFS(M11=0,0,M11=1,0,M11=2,50,M11=3,100,M11=4,150))","v":""},"",0]
[9,{"$f":"IF(Carreras!$K4=0,\"\",Carreras!$K4)","v":""},{"$f":"IF(B12=\"\",\"\",_xlfn.XLOOKUP(B12,Socios!A:A,Socios!B:B,FALSE,0,1))","v":""},{"$f":"IF(B12=\"\",\"\",_xlfn.XLOOKUP(B12,Socios!A:A,Socios!C:C,FALSE,0,1))","v":""},{"$f":"IF($B12=\"\",\"\",_xlfn.XLOOKUP($B12,Carreras!$B:$B,Carreras!$A:$A,0,0,1))","v":""},{"$f":"IF($B12=\"\",\"\",IF($E12=0,0,_xlfn.XLOOKUP($E12,Puntos!A:A,Puntos!B:B,TRUE)))","v":""},{"$f":"IF($B12=\"\",\"\",_xlfn.XLOOKUP($B12,Carreras!C:C,Carreras!A:A,0,0,1))","v":""},{"$f":"IF($B12=\"\",\"\",IF($G12=0,0,_xlfn.XLOOKUP($G12,Puntos!A:A,Puntos!B:B,TRUE)))","v":""},{"$f":"IF($B12=\"\",\"\",_xlfn.XLOOKUP($B12,Carreras!$D:$D,Carreras!$A:$A,0,0,1))","v":""},{"$f":"IF($B12=\"\",\"\",IF($I12=0,0,_xlfn.XLOOKUP($I12,Puntos!A:A,Puntos!B:B,TRUE)))","v":""},{"$f":"IF($B12=\"\",\"\",_xlfn.XLOOKUP($B12,Carreras!$E:$E,Carreras!$A:$A,0,0,1))","v":""},{"$f":"IF($B12=\"\",\"\",IF($K12=0,0,_xlfn.XLOOKUP($K12,Puntos!$A:$A,Puntos!$B:$B)))","v":""},"",{"$f":"IF(B12=\"\",\"\",_xlfn.IFS(M12=0,0,M12=1,0,M12=2,50,M12=3,100,M12=4,150))","v":""},"",0]
[10,{"$f":"IF(Carreras!$K12=0,\"\",Carreras!$K12)","v":""},{"$f":"IF(B13=\"\",\"\",_xlfn.XLOOKUP(B13,Socios!A:A,Socios!B:B,FALSE,0,1))","v":""},{"$f":"IF(B13=\"\",\"\",_xlfn.XLOOKUP(B13,Socios!A:A,Socios!C:C,FALSE,0,1))","v":""},{"$f":"IF($B13=\"\",\"\",_xlfn.XLOOKUP($B13,Carreras!$B:$B,Carreras!$A:$A,0,0,1))","v":""},{"$f":"IF($B13=\"\",\"\",IF($E13=0,0,_xlfn.XLOOKUP($E13,Puntos!A:A,Puntos!B:B,TRUE)))","v":""},{"$f":"IF($B13=\"\",\"\",_xlfn.XLOOKUP($B13,Carreras!C:C,Carreras!A:A,0,0,1))","v":""},{"$f":"IF($B13=\"\",\"\",IF($G13=0,0,_xlfn.XLOOKUP($G13,Puntos!A:A,Puntos!B:B,TRUE)))","v":""},{"$f":"IF($B13=\"\",\"\",_xlfn.XLOOKUP($B13,Carreras!$D:$D,Carreras!$A:$A,0,0,1))","v":""},{"$f":"IF($B13=\"\",\"\",IF($I13=0,0,_xlfn.XLOOKUP($I13,Puntos!A:A,Puntos!B:B,TRUE)))","v":""},{"$f":"IF($B13=\"\",\"\",_xlfn.XLOOKUP($B13,Carreras!$E:$E,Carreras!$A:$A,0,0,1))","v":""},{"$f":"IF($B13=\"\",\"\",IF($K13=0,0,_xlfn.XLOOKUP($K13,Puntos!$A:$A,Puntos!$B:$B)))","v":""},"",{"$f":"IF(B13=\"\",\"\",_xlfn.IFS(M13=0,0,M13=1,0,M13=2,50,M13=3,100,M13=4,150))","v":""},"",0]
[11,{"$f":"IF(Carreras!$K13=0,\"\",Carreras!$K13)","v":""},{"$f":"IF(B14=\"\",\"\",_xlfn.XLOOKUP(B14,Socios!A:A,Socios!B:B,FALSE,0,1))","v":""},{"$f":"IF(B14=\"\",\"\",_xlfn.XLOOKUP(B14,Socios!A:A,Socios!C:C,FALSE,0,1))","v":""},{"$f":"IF($B14=\"\",\"\",_xlfn.XLOOKUP($B14,Carreras!$B:$B,Carreras!$A:$A,0,0,1))","v":""},{"$f":"IF($B14=\"\",\"\",IF($E14=0,0,_xlfn.XLOOKUP($E14,Puntos!A:A,Puntos!B:B,TRUE)))","v":""},{"$f":"IF($B14=\"\",\"\",_xlfn.XLOOKUP($B14,Carreras!C:C,Carreras!A:A,0,0,1))","v":""},{"$f":"IF($B14=\"\",\"\",IF($G14=0,0,_xlfn.XLOOKUP($G14,Puntos!A:A,Puntos!B:B,TRUE)))","v":""},{"$f":"IF($B14=\"\",\"\",_xlfn.XLOOKUP($B14,Carreras!$D:$D,Carreras!$A:$A,0,0,1))","v":""},{"$f":"IF($B14=\"\",\"\",IF($I14=0,0,_xlfn.XLOOKUP($I14,Puntos!A:A,Puntos!B:B,TRUE)))","v":""},{"$f":"IF($B14=\"\",\"\",_xlfn.XLOOKUP($B14,Carreras!$E:$E,Carreras!$A:$A,0,0,1))","v":""},{"$f":"IF($B14=\"\",\"\",IF($K14=0,0,_xlfn.XLOOKUP($K14,Puntos!$A:$A,Puntos!$B:$B)))","v":""},"",{"$f":"IF(B14=\"\",\"\",_xlfn.IFS(M14=0,0,M14=1,0,M14=2,50,M14=3,100,M14=4,150))","v":""},"",0]
[12,{"$f":"IF(Carreras!$K14=0,\"\",Carreras!$K14)","v":""},{"$f":"IF(B15=\"\",\"\",_xlfn.XLOOKUP(B15,Socios!A:A,Socios!B:B,FALSE,0,1))","v":""},{"$f":"IF(B15=\"\",\"\",_xlfn.XLOOKUP(B15,Socios!A:A,Socios!C:C,FALSE,0,1))","v":""},{"$f":"IF($B15=\"\",\"\",_xlfn.XLOOKUP($B15,Carreras!$B:$B,Carreras!$A:$A,0,0,1))","v":""},{"$f":"IF($B15=\"\",\"\",IF($E15=0,0,_xlfn.XLOOKUP($E15,Puntos!A:A,Puntos!B:B,TRUE)))","v":""},{"$f":"IF($B15=\"\",\"\",_xlfn.XLOOKUP($B15,Carreras!C:C,Carreras!A:A,0,0,1))","v":""},{"$f":"IF($B15=\"\",\"\",IF($G15=0,0,_xlfn.XLOOKUP($G15,Puntos!A:A,Puntos!B:B,TRUE)))","v":""},{"$f":"IF($B15=\"\",\"\",_xlfn.XLOOKUP($B15,Carreras!$D:$D,Carreras!$A:$A,0,0,1))","v":""},{"$f":"IF($B15=\"\",\"\",IF($I15=0,0,_xlfn.XLOOKUP($I15,Puntos!A:A,Puntos!B:B,TRUE)))","v":""},{"$f":"IF($B15=\"\",\"\",_xlfn.XLOOKUP($B15,Carreras!$E:$E,Carreras!$A:$A,0,0,1))","v":""},{"$f":"IF($B15=\"\",\"\",IF($K15=0,0,_xlfn.XLOOKUP($K15,Puntos!$A:$A,Puntos!$B:$B)))","v":""},"",{"$f":"IF(B15=\"\",\"\",_xlfn.IFS(M15=0,0,M15=1,0,M15=2,50,M15=3,100,M15=4,150))","v":""},"",0]
[13,{"$f":"IF(Carreras!$K15=0,\"\",Carreras!$K15)","v":""},{"$f":"IF(B16=\"\",\"\",_xlfn.XLOOKUP(B16,Socios!A:A,Socios!B:B,FALSE,0,1))","v":""},{"$f":"IF(B16=\"\",\"\",_xlfn.XLOOKUP(B16,Socios!A:A,Socios!C:C,FALSE,0,1))","v":""},{"$f":"IF($B16=\"\",\"\",_xlfn.XLOOKUP($B16,Carreras!$B:$B,Carreras!$A:$A,0,0,1))","v":""},{"$f":"IF($B16=\"\",\"\",IF($E16=0,0,_xlfn.XLOOKUP($E16,Puntos!A:A,Puntos!B:B,TRUE)))","v":""},{"$f":"IF($B16=\"\",\"\",_xlfn.XLOOKUP($B16,Carreras!C:C,Carreras!A:A,0,0,1))","v":""},{"$f":"IF($B16=\"\",\"\",IF($G16=0,0,_xlfn.XLOOKUP($G16,Puntos!A:A,Puntos!B:B,TRUE)))","v":""},{"$f":"IF($B16=\"\",\"\",_xlfn.XLOOKUP($B16,Carreras!$D:$D,Carreras!$A:$A,0,0,1))","v":""},{"$f":"IF($B16=\"\",\"\",IF($I16=0,0,_xlfn.XLOOKUP($I16,Puntos!A:A,Puntos!B:B,TRUE)))","v":""},{"$f":"IF($B16=\"\",\"\",_xlfn.XLOOKUP($B16,Carreras!$E:$E,Carreras!$A:$A,0,0,1))","v":""},{"$f":"IF($B16=\"\",\"\",IF($K16=0,0,_xlfn.XLOOKUP($K16,Puntos!$A:$A,Puntos!$B:$B)))","v":""},"",{"$f":"IF(B16=\"\",\"\",_xlfn.IFS(M16=0,0,M16=1,0,M16=2,50,M16=3,100,M16=4,150))","v":""},"",0]
[14,{"$f":"IF(Carreras!$K11=0,\"\",Carreras!$K11)","v":""},{"$f":"IF(B17=\"\",\"\",_xlfn.XLOOKUP(B17,Socios!A:A,Socios!B:B,FALSE,0,1))","v":""},{"$f":"IF(B17=\"\",\"\",_xlfn.XLOOKUP(B17,Socios!A:A,Socios!C:C,FALSE,0,1))","v":""},{"$f":"IF($B17=\"\",\"\",_xlfn.XLOOKUP($B17,Carreras!$B:$B,Carreras!$A:$A,0,0,1))","v":""},{"$f":"IF($B17=\"\",\"\",IF($E17=0,0,_xlfn.XLOOKUP($E17,Puntos!A:A,Puntos!B:B,TRUE)))","v":""},{"$f":"IF($B17=\"\",\"\",_xlfn.XLOOKUP($B17,Carreras!C:C,Carreras!A:A,0,0,1))","v":""},{"$f":"IF($B17=\"\",\"\",IF($G17=0,0,_xlfn.XLOOKUP($G17,Puntos!A:A,Puntos!B:B,TRUE)))","v":""},{"$f":"IF($B17=\"\",\"\",_xlfn.XLOOKUP($B17,Carreras!$D:$D,Carreras!$A:$A,0,0,1))","v":""},{"$f":"IF($B17=\"\",\"\",IF($I17=0,0,_xlfn.XLOOKUP($I17,Puntos!A:A,Puntos!B:B,TRUE)))","v":""},{"$f":"IF($B17=\"\",\"\",_xlfn.XLOOKUP($B17,Carreras!$E:$E,Carreras!$A:$A,0,0,1))","v":""},{"$f":"IF($B17=\"\",\"\",IF($K17=0,0,_xlfn.XLOOKUP($K17,Puntos!$A:$A,Puntos!$B:$B)))","v":""},"",{"$f":"IF(B17=\"\",\"\",_xlfn.IFS(M17=0,0,M17=1,0,M17=2,50,M17=3,100,M17=4,150))","v":""},"",0]
[15,{"$f":"IF(Carreras!$K16=0,\"\",Carreras!$K16)","v":""},{"$f":"IF(B18=\"\",\"\",_xlfn.XLOOKUP(B18,Socios!A:A,Socios!B:B,FALSE,0,1))","v":""},{"$f":"IF(B18=\"\",\"\",_xlfn.XLOOKUP(B18,Socios!A:A,Socios!C:C,FALSE,0,1))","v":""},{"$f":"IF($B18=\"\",\"\",_xlfn.XLOOKUP($B18,Carreras!$B:$B,Carreras!$A:$A,0,0,1))","v":""},{"$f":"IF($B18=\"\",\"\",IF($E18=0,0,_xlfn.XLOOKUP($E18,Puntos!A:A,Puntos!B:B,TRUE)))","v":""},{"$f":"IF($B18=\"\",\"\",_xlfn.XLOOKUP($B18,Carreras!C:C,Carreras!A:A,0,0,1))","v":""},{"$f":"IF($B18=\"\",\"\",IF($G18=0,0,_xlfn.XLOOKUP($G18,Puntos!A:A,Puntos!B:B,TRUE)))","v":""},{"$f":"IF($B18=\"\",\"\",_xlfn.XLOOKUP($B18,Carreras!$D:$D,Carreras!$A:$A,0,0,1))","v":""},{"$f":"IF($B18=\"\",\"\",IF($I18=0,0,_xlfn.XLOOKUP($I18,Puntos!A:A,Puntos!B:B,TRUE)))","v":""},{"$f":"IF($B18=\"\",\"\",_xlfn.XLOOKUP($B18,Carreras!$E:$E,Carreras!$A:$A,0,0,1))","v":""},{"$f":"IF($B18=\"\",\"\",IF($K18=0,0,_xlfn.XLOOKUP($K18,Puntos!$A:$A,Puntos!$B:$B)))","v":""},"",{"$f":"IF(B18=\"\",\"\",_xlfn.IFS(M18=0,0,M18=1,0,M18=2,50,M18=3,100,M18=4,150))","v":""},"",0]
[16,{"$f":"IF(Carreras!$K17=0,\"\",Carreras!$K17)","v":""},{"$f":"IF(B19=\"\",\"\",_xlfn.XLOOKUP(B19,Socios!A:A,Socios!B:B,FALSE,0,1))","v":""},{"$f":"IF(B19=\"\",\"\",_xlfn.XLOOKUP(B19,Socios!A:A,Socios!C:C,FALSE,0,1))","v":""},{"$f":"IF($B19=\"\",\"\",_xlfn.XLOOKUP($B19,Carreras!$B:$B,Carreras!$A:$A,0,0,1))","v":""},{"$f":"IF($B19=\"\",\"\",IF($E19=0,0,_xlfn.XLOOKUP($E19,Puntos!A:A,Puntos!B:B,TRUE)))","v":""},{"$f":"IF($B19=\"\",\"\",_xlfn.XLOOKUP($B19,Carreras!C:C,Carreras!A:A,0,0,1))","v":""},{"$f":"IF($B19=\"\",\"\",IF($G19=0,0,_xlfn.XLOOKUP($G19,Puntos!A:A,Puntos!B:B,TRUE)))","v":""},{"$f":"IF($B19=\"\",\"\",_xlfn.XLOOKUP($B19,Carreras!$D:$D,Carreras!$A:$A,0,0,1))","v":""},{"$f":"IF($B19=\"\",\"\",IF($I19=0,0,_xlfn.XLOOKUP($I19,Puntos!A:A,Puntos!B:B,TRUE)))","v":""},{"$f":"IF($B19=\"\",\"\",_xlfn.XLOOKUP($B19,Carreras!$E:$E,Carreras!$A:$A,0,0,1))","v":""},{"$f":"IF($B19=\"\",\"\",IF($K19=0,0,_xlfn.XLOOKUP($K19,Puntos!$A:$A,Puntos!$B:$B)))","v":""},"",{"$f":"IF(B19=\"\",\"\",_xlfn.IFS(M19=0,0,M19=1,0,M19=2,50,M19=3,100,M19=4,150))","v":""},"",0]
[17,{"$f":"IF(Carreras!$K18=0,\"\",Carreras!$K18)","v":""},{"$f":"IF(B20=\"\",\"\",_xlfn.XLOOKUP(B20,Socios!A:A,Socios!B:B,FALSE,0,1))","v":""},{"$f":"IF(B20=\"\",\"\",_xlfn.XLOOKUP(B20,Socios!A:A,Socios!C:C,FALSE,0,1))","v":""},{"$f":"IF($B20=\"\",\"\",_xlfn.XLOOKUP($B20,Carreras!$B:$B,Carreras!$A:$A,0,0,1))","v":""},{"$f":"IF($B20=\"\",\"\",IF($E20=0,0,_xlfn.XLOOKUP($E20,Puntos!A:A,Puntos!B:B,TRUE)))","v":""},{"$f":"IF($B20=\"\",\"\",_xlfn.XLOOKUP($B20,Carreras!C:C,Carreras!A:A,0,0,1))","v":""},{"$f":"IF($B20=\"\",\"\",IF($G20=0,0,_xlfn.XLOOKUP($G20,Puntos!A:A,Puntos!B:B,TRUE)))","v":""},{"$f":"IF($B20=\"\",\"\",_xlfn.XLOOKUP($B20,Carreras!$D:$D,Carreras!$A:$A,0,0,1))","v":""},{"$f":"IF($B20=\"\",\"\",IF($I20=0,0,_xlfn.XLOOKUP($I20,Puntos!A:A,Puntos!B:B,TRUE)))","v":""},{"$f":"IF($B20=\"\",\"\",_xlfn.XLOOKUP($B20,Carreras!$E:$E,Carreras!$A:$A,0,0,1))","v":""},{"$f":"IF($B20=\"\",\"\",IF($K20=0,0,_xlfn.XLOOKUP($K20,Puntos!$A:$A,Puntos!$B:$B)))","v":""},"",{"$f":"IF(B20=\"\",\"\",_xlfn.IFS(M20=0,0,M20=1,0,M20=2,50,M20=3,100,M20=4,150))","v":""},"",0]
{"$rows_left_out":84}
{"sheet":"Puntos","index":1,"n_rows":116,"n_cols":4,"rows_kept":116,"cut":false,"hidden":false,"merged":[]}
["Puesto","Puntos",null,"participantes"]
[1,640]
[2,613]
[3,587]
[4,562]
[5,538]
[6,515]
[7,493]
[8,472]
[9,452]
[10,433]
[11,414]
[12,396]
[13,379]
[14,363]
[15,347]
[16,332]
[17,318]
[18,304]
[19,291]
{"$rows_left_out":97}
{"sheet":"Socios","index":2,"n_rows":0,"n_cols":0,"rows_kept":0,"cut":false,"hidden":false,"merged":[]}

{"sheet":"Carreras","index":3,"n_rows":400,"n_cols":11,"rows_kept":400,"cut":false,"hidden":false,"merged":[]}
["ORDEN","CARRERA1","CARRERA2","CARRERA3","CARRERA4",null,null,null,null,null,"Participantes"]
[1,null,null,null,null,null,null,null,null,{"$f":"B2","v":0},0]
[{"$f":"A2+1","v":2},null,null,null,null,null,null,null,null,{"$f":"C2","v":0}]
[3,null,null,null,null,null,null,null,null,{"$f":"D2","v":0}]
[4,null,null,null,null,null,null,null,null,{"$f":"E2","v":0}]
[5,null,null,null,null,null,null,null,null,{"$f":"B3","v":0}]
[6,null,null,null,null,null,null,null,null,{"$f":"C3","v":0}]
[7,null,null,null,null,null,null,null,null,{"$f":"D3","v":0}]
[8,null,null,null,null,null,null,null,null,{"$f":"E3","v":0}]
[9,null,null,null,null,null,null,null,null,{"$f":"B4","v":0}]
[10,null,null,null,null,null,null,null,null,{"$f":"C4","v":0}]
[11,null,null,null,null,null,null,null,null,{"$f":"D4","v":0}]
[12,null,null,null,null,null,null,null,null,{"$f":"E4","v":0}]
[13,null,null,null,null,null,null,null,null,{"$f":"B5","v":0}]
[14,null,null,null,null,null,null,null,null,{"$f":"C5","v":0}]
[15,null,null,null,null,null,null,null,null,{"$f":"D5","v":0}]
[16,null,null,null,null,null,null,null,null,{"$f":"E5","v":0}]
[17,null,null,null,null,null,null,null,null,{"$f":"B6","v":0}]
[18,null,null,null,null,null,null,null,null,{"$f":"C6","v":0}]
[19,null,null,null,null,null,null,null,null,{"$f":"D6","v":0}]
{"$rows_left_out":380}